PDA

Visualizza la versione completa : problema ricompilazione kernel


alkat
04-07-2005, 15:16
ciao,
ho scaricato il kernel 2.6.12.2 e stavo provando a configurarlo, ma ecco cosa succede:


# make menuconfig
HOSTCC scripts/basic/fixdep
scripts/basic/fixdep.c:105:23: sys/types.h: No such file or directory
scripts/basic/fixdep.c:106:22: sys/stat.h: No such file or directory
scripts/basic/fixdep.c:107:22: sys/mman.h: No such file or directory
scripts/basic/fixdep.c:108:20: unistd.h: No such file or directory
scripts/basic/fixdep.c:109:19: fcntl.h: No such file or directory
scripts/basic/fixdep.c:110:20: string.h: No such file or directory
scripts/basic/fixdep.c:111:20: stdlib.h: No such file or directory
scripts/basic/fixdep.c:112:19: stdio.h: No such file or directory
In file included from /usr/lib/gcc-lib/i486-linux/3.3.5/include/syslimits.h:7,
from /usr/lib/gcc-lib/i486-linux/3.3.5/include/limits.h:11,
from scripts/basic/fixdep.c:113:
/usr/lib/gcc-lib/i486-linux/3.3.5/include/limits.h:122:75: limits.h: No such file or directory
scripts/basic/fixdep.c:114:19: ctype.h: No such file or directory
scripts/basic/fixdep.c:115:23: arpa/inet.h: No such file or directory
scripts/basic/fixdep.c: In function `usage':
scripts/basic/fixdep.c:129: warning: implicit declaration of function `fprintf'
scripts/basic/fixdep.c:129: error: `stderr' undeclared (first use in this function)
scripts/basic/fixdep.c:129: error: (Each undeclared identifier is reported only once
scripts/basic/fixdep.c:129: error: for each function it appears in.)
scripts/basic/fixdep.c:130: warning: implicit declaration of function `exit'
scripts/basic/fixdep.c: In function `print_cmdline':
scripts/basic/fixdep.c:135: warning: implicit declaration of function `printf'
scripts/basic/fixdep.c: At top level:
scripts/basic/fixdep.c:138: error: `NULL' undeclared here (not in a function)
scripts/basic/fixdep.c: In function `grow_config':
scripts/basic/fixdep.c:151: warning: implicit declaration of function `realloc'
scripts/basic/fixdep.c:151: warning: assignment makes pointer from integer without a cast
scripts/basic/fixdep.c:152: error: `NULL' undeclared (first use in this function)
scripts/basic/fixdep.c:153: warning: implicit declaration of function `perror'
scripts/basic/fixdep.c: In function `is_defined_config':
scripts/basic/fixdep.c:169: warning: implicit declaration of function `memcmp'
scripts/basic/fixdep.c: In function `define_config':
scripts/basic/fixdep.c:182: warning: implicit declaration of function `memcpy'
scripts/basic/fixdep.c: In function `use_config':
scripts/basic/fixdep.c:201: error: `PATH_MAX' undeclared (first use in this function)
scripts/basic/fixdep.c:215: warning: implicit declaration of function `tolower'
scripts/basic/fixdep.c:201: warning: unused variable `s'
scripts/basic/fixdep.c: At top level:
scripts/basic/fixdep.c:220: error: syntax error before "size_t"
scripts/basic/fixdep.c:221: warning: function declaration isn't a prototype
scripts/basic/fixdep.c: In function `parse_config_file':
scripts/basic/fixdep.c:222: error: `map' undeclared (first use in this function)
scripts/basic/fixdep.c:222: error: `len' undeclared (first use in this function)
scripts/basic/fixdep.c:228: warning: implicit declaration of function `ntohl'
scripts/basic/fixdep.c:239: warning: implicit declaration of function `isalnum'
scripts/basic/fixdep.c: In function `strrcmp':
scripts/basic/fixdep.c:252: warning: implicit declaration of function `strlen'
scripts/basic/fixdep.c: In function `do_config_file':
scripts/basic/fixdep.c:263: error: storage size of `st' isn't known
scripts/basic/fixdep.c:267: warning: implicit declaration of function `open'
scripts/basic/fixdep.c:267: error: `O_RDONLY' undeclared (first use in this function)
scripts/basic/fixdep.c:269: error: `stderr' undeclared (first use in this function)
scripts/basic/fixdep.c:273: warning: implicit declaration of function `fstat'
scripts/basic/fixdep.c:275: warning: implicit declaration of function `close'
scripts/basic/fixdep.c:278: warning: implicit declaration of function `mmap'
scripts/basic/fixdep.c:278: error: `NULL' undeclared (first use in this function)
scripts/basic/fixdep.c:278: error: `PROT_READ' undeclared (first use in this function)
scripts/basic/fixdep.c:278: error: `MAP_PRIVATE' undeclared (first use in this function)
scripts/basic/fixdep.c:278: warning: assignment makes pointer from integer without a cast
scripts/basic/fixdep.c:287: warning: implicit declaration of function `munmap'
scripts/basic/fixdep.c:263: warning: unused variable `st'
scripts/basic/fixdep.c: At top level:
scripts/basic/fixdep.c:292: error: syntax error before "size_t"
scripts/basic/fixdep.c:293: warning: function declaration isn't a prototype
scripts/basic/fixdep.c: In function `parse_dep_file':
scripts/basic/fixdep.c:294: error: `map' undeclared (first use in this function)
scripts/basic/fixdep.c:295: error: `len' undeclared (first use in this function)
scripts/basic/fixdep.c:297: error: `PATH_MAX' undeclared (first use in this function)
scripts/basic/fixdep.c:299: warning: implicit declaration of function `strchr'
scripts/basic/fixdep.c:301: error: `stderr' undeclared (first use in this function)
scripts/basic/fixdep.c:297: warning: unused variable `s'
scripts/basic/fixdep.c: In function `print_deps':
scripts/basic/fixdep.c:334: error: storage size of `st' isn't known
scripts/basic/fixdep.c:338: error: `O_RDONLY' undeclared (first use in this function)
scripts/basic/fixdep.c:340: error: `stderr' undeclared (first use in this function)
scripts/basic/fixdep.c:350: error: `NULL' undeclared (first use in this function)
scripts/basic/fixdep.c:350: error: `PROT_READ' undeclared (first use in this function)
scripts/basic/fixdep.c:350: error: `MAP_PRIVATE' undeclared (first use in this function)
scripts/basic/fixdep.c:350: warning: assignment makes pointer from integer without a cast
scripts/basic/fixdep.c:334: warning: unused variable `st'
scripts/basic/fixdep.c: In function `traps':
scripts/basic/fixdep.c:369: error: `stderr' undeclared (first use in this function)
make[1]: *** [scripts/basic/fixdep] Error 1
make: *** [scripts_basic] Error 2

che problemi ha? io non riesco a capire...

sembra che manchino dei file o directory, ma ho scaricato e scompattato il kernel da kernel.org due volte.

.a.

eraclito
04-07-2005, 15:21
Originariamente inviato da alkat
ciao,
ho scaricato il kernel 2.6.12.2 e stavo provando a configurarlo, ma ecco cosa succede:


# make menuconfig
HOSTCC scripts/basic/fixdep
scripts/basic/fixdep.c:105:23: sys/types.h: No such file or directory
scripts/basic/fixdep.c:106:22: sys/stat.h: No such file or directory
scripts/basic/fixdep.c:107:22: sys/mman.h: No such file or directory
scripts/basic/fixdep.c:108:20: unistd.h: No such file or directory
scripts/basic/fixdep.c:109:19: fcntl.h: No such file or directory
scripts/basic/fixdep.c:110:20: string.h: No such file or directory
scripts/basic/fixdep.c:111:20: stdlib.h: No such file or directory
scripts/basic/fixdep.c:112:19: stdio.h: No such file or directory
In file included from /usr/lib/gcc-lib/i486-linux/3.3.5/include/syslimits.h:7,
from /usr/lib/gcc-lib/i486-linux/3.3.5/include/limits.h:11,
from scripts/basic/fixdep.c:113:
/usr/lib/gcc-lib/i486-linux/3.3.5/include/limits.h:122:75: limits.h: No such file or directory
scripts/basic/fixdep.c:114:19: ctype.h: No such file or directory
scripts/basic/fixdep.c:115:23: arpa/inet.h: No such file or directory
scripts/basic/fixdep.c: In function `usage':
scripts/basic/fixdep.c:129: warning: implicit declaration of function `fprintf'
scripts/basic/fixdep.c:129: error: `stderr' undeclared (first use in this function)
scripts/basic/fixdep.c:129: error: (Each undeclared identifier is reported only once
scripts/basic/fixdep.c:129: error: for each function it appears in.)
scripts/basic/fixdep.c:130: warning: implicit declaration of function `exit'
scripts/basic/fixdep.c: In function `print_cmdline':
scripts/basic/fixdep.c:135: warning: implicit declaration of function `printf'
scripts/basic/fixdep.c: At top level:
scripts/basic/fixdep.c:138: error: `NULL' undeclared here (not in a function)
scripts/basic/fixdep.c: In function `grow_config':
scripts/basic/fixdep.c:151: warning: implicit declaration of function `realloc'
scripts/basic/fixdep.c:151: warning: assignment makes pointer from integer without a cast
scripts/basic/fixdep.c:152: error: `NULL' undeclared (first use in this function)
scripts/basic/fixdep.c:153: warning: implicit declaration of function `perror'
scripts/basic/fixdep.c: In function `is_defined_config':
scripts/basic/fixdep.c:169: warning: implicit declaration of function `memcmp'
scripts/basic/fixdep.c: In function `define_config':
scripts/basic/fixdep.c:182: warning: implicit declaration of function `memcpy'
scripts/basic/fixdep.c: In function `use_config':
scripts/basic/fixdep.c:201: error: `PATH_MAX' undeclared (first use in this function)
scripts/basic/fixdep.c:215: warning: implicit declaration of function `tolower'
scripts/basic/fixdep.c:201: warning: unused variable `s'
scripts/basic/fixdep.c: At top level:
scripts/basic/fixdep.c:220: error: syntax error before "size_t"
scripts/basic/fixdep.c:221: warning: function declaration isn't a prototype
scripts/basic/fixdep.c: In function `parse_config_file':
scripts/basic/fixdep.c:222: error: `map' undeclared (first use in this function)
scripts/basic/fixdep.c:222: error: `len' undeclared (first use in this function)
scripts/basic/fixdep.c:228: warning: implicit declaration of function `ntohl'
scripts/basic/fixdep.c:239: warning: implicit declaration of function `isalnum'
scripts/basic/fixdep.c: In function `strrcmp':
scripts/basic/fixdep.c:252: warning: implicit declaration of function `strlen'
scripts/basic/fixdep.c: In function `do_config_file':
scripts/basic/fixdep.c:263: error: storage size of `st' isn't known
scripts/basic/fixdep.c:267: warning: implicit declaration of function `open'
scripts/basic/fixdep.c:267: error: `O_RDONLY' undeclared (first use in this function)
scripts/basic/fixdep.c:269: error: `stderr' undeclared (first use in this function)
scripts/basic/fixdep.c:273: warning: implicit declaration of function `fstat'
scripts/basic/fixdep.c:275: warning: implicit declaration of function `close'
scripts/basic/fixdep.c:278: warning: implicit declaration of function `mmap'
scripts/basic/fixdep.c:278: error: `NULL' undeclared (first use in this function)
scripts/basic/fixdep.c:278: error: `PROT_READ' undeclared (first use in this function)
scripts/basic/fixdep.c:278: error: `MAP_PRIVATE' undeclared (first use in this function)
scripts/basic/fixdep.c:278: warning: assignment makes pointer from integer without a cast
scripts/basic/fixdep.c:287: warning: implicit declaration of function `munmap'
scripts/basic/fixdep.c:263: warning: unused variable `st'
scripts/basic/fixdep.c: At top level:
scripts/basic/fixdep.c:292: error: syntax error before "size_t"
scripts/basic/fixdep.c:293: warning: function declaration isn't a prototype
scripts/basic/fixdep.c: In function `parse_dep_file':
scripts/basic/fixdep.c:294: error: `map' undeclared (first use in this function)
scripts/basic/fixdep.c:295: error: `len' undeclared (first use in this function)
scripts/basic/fixdep.c:297: error: `PATH_MAX' undeclared (first use in this function)
scripts/basic/fixdep.c:299: warning: implicit declaration of function `strchr'
scripts/basic/fixdep.c:301: error: `stderr' undeclared (first use in this function)
scripts/basic/fixdep.c:297: warning: unused variable `s'
scripts/basic/fixdep.c: In function `print_deps':
scripts/basic/fixdep.c:334: error: storage size of `st' isn't known
scripts/basic/fixdep.c:338: error: `O_RDONLY' undeclared (first use in this function)
scripts/basic/fixdep.c:340: error: `stderr' undeclared (first use in this function)
scripts/basic/fixdep.c:350: error: `NULL' undeclared (first use in this function)
scripts/basic/fixdep.c:350: error: `PROT_READ' undeclared (first use in this function)
scripts/basic/fixdep.c:350: error: `MAP_PRIVATE' undeclared (first use in this function)
scripts/basic/fixdep.c:350: warning: assignment makes pointer from integer without a cast
scripts/basic/fixdep.c:334: warning: unused variable `st'
scripts/basic/fixdep.c: In function `traps':
scripts/basic/fixdep.c:369: error: `stderr' undeclared (first use in this function)
make[1]: *** [scripts/basic/fixdep] Error 1
make: *** [scripts_basic] Error 2

che problemi ha? io non riesco a capire...

sembra che manchino dei file o directory, ma ho scaricato e scompattato il kernel da kernel.org due volte.

.a.

ma hai creato il collegamento /usr/src/linux ?

alkat
04-07-2005, 15:27
Originariamente inviato da eraclito
ma hai creato il collegamento /usr/src/linux ?

certo, e ho lanciato make menuconfig da dentro /usr/src/linux

.a.

stai_tranquillo
04-07-2005, 15:30
ripulisci eventuali configurazioni precedenti con
make mrproper
e rilancia il make menuconfig

se ti da ancora errore poterbbero essere i sorgenti del kernel rovinati, magari riscaricalo

Shenk87
04-07-2005, 15:30
non credo che servirà ma cmq prova a dare un make mrproper prima (salvati il config prima però), e prova make xconfig o gconfig

alkat
04-07-2005, 15:36
Originariamente inviato da Shenk87
non credo che servirà ma cmq prova a dare un make mrproper prima (salvati il config prima però), e prova make xconfig o gconfig

avevo già provato a dare make mrproper (anche se non ha molto senso visto che ho installato il sistema stanotte...) ma ovviamente non è servito a nulla. mi restituisce lo stesso errore.

secondo voi è il file corrotto?

eppure l'ho scaricato con wget...

.a.

Neon87
04-07-2005, 15:40
prova a installare build-essential

alkat
04-07-2005, 15:43
Originariamente inviato da Neon87
prova a installare build-essential

a cosa dovrebbe servire?


Package: build-essential
Priority: optional
Section: devel
Installed-Size: 48
Maintainer: Scott James Remnant <scott@netsplit.com>
Architecture: i386
Version: 10.1
Depends: libc6-dev | libc-dev, gcc (>= 3:3.3), g++ (>= 3:3.3), make, dpkg-dev (>= 1.4.1.19)
Filename: pool/main/b/build-essential/build-essential_10.1_i386.deb
Size: 6520
MD5sum: 3b80d3a5cbea271bba1380f3a5e3e4e2
Description: informational list of build-essential packages
If you do not plan to build Debian packages, you don't need this
package. Moreover this package is not required for building Debian
packages.
.
This package contains an informational list of packages which are
considered essential for building Debian packages. This package also
depends on the packages on that list, to make it easy to have the
build-essential packages installed.
.
If you have this package installed, you only need to install whatever
a package specifies as its build-time dependencies to build the
package. Conversely, if you are determining what your package needs
to build-depend on, you can always leave out the packages this
package depends on.
.
This package is NOT the definition of what packages are
build-essential; the real definition is in the Debian Policy Manual.
This package contains merely an informational list, which is all
most people need. However, if this package and the manual disagree,
the manual is correct.

Neon87
04-07-2005, 15:46
avevo un problema analogo e ho risolto con quel pacchetto...

edit:
credo sia perche' installa libc6-dev come dipendenza...

alkat
04-07-2005, 15:58
Originariamente inviato da Neon87
avevo un problema analogo e ho risolto con quel pacchetto...

edit:
credo sia perche' installa libc6-dev come dipendenza...


funziona...

thanks,
:ciauz:
.a.

Loading